BDBM50084136 (R)-1-Amino-indan-1,5-dicarboxylic acid::CHEMBL358882
SMILES N[C@@]1(CCc2cc(ccc12)C(O)=O)C(O)=O
InChI Key InChIKey=LSTPKMWNRWCNLS-LLVKDONJSA-N
Data  2 IC50
  Tab Delimited (TSV)   2D SDfile   Computed 3D by Vconf -m prep SDfile
Find this compound or compounds like it in BindingDB:
Activity Spreadsheet -- Enzyme Inhibition Constant Data from BindingDB
Found 1 hit for monomerid = 50084136
TargetMetabotropic glutamate receptor 5(Homo sapiens (Human))
Universit¿A Di Perugia
Curated by ChEMBL
LigandPNGBDBM50084136((R)-1-Amino-indan-1,5-dicarboxylic acid | CHEMBL35...)
Affinity DataIC50: >1.00E+6nM. Assay description: Compound was tested for it's antagonist activity against Ser152 and Thr175 (Metabotropic glutamate receptor 5)
In DepthDetails ArticlePubMed